Target
Insulin-degrading enzyme
Ligand
BDBM50738
Substrate
Meas. Tech.
Dose Response: Fluorescence polarization-based cell-based high throughput dose response assay for inhibitors of insulin-degrading enzyme (IDE)
IC50
570.66±n/a nM
Citation
 PubChem, PC Dose Response: Fluorescence polarization-based cell-based high throughput dose response assay for inhibitors of insulin-degrading enzyme (IDE) PubChem Bioassay (2010)[AID] 
Target
Name:
Insulin-degrading enzyme
Synonyms:
Abeta-degrading protease IDE Insulin degrading enzyme (hIDE) Insulin-degrading enzyme Insulysin | insulin-degrading enzyme isoform 1 precursor
Type:
Enzyme Catalytic Domain
Mol. Mass.:
117968.59
Organism:
Homo sapiens (Human)
Description:
P14735
Residue:
1019
  
Inhibitor
Name:
BDBM50738
Synonyms:
MLS000762832 N-[1-(2,3-Dimethoxy-phenyl)-meth-(E)-ylidene]-N'-(8-methyl-5H-pyrimido[5,4-b]indol-4-yl)-hydrazine [(2,3-dimethoxybenzylidene)amino]-(8-methyl-5H-pyrimid[5,4-b]indol-4-yl)amine | cid_4895375
Type:
Small organic molecule
Emp. Form.:
C20H19N5O2
Mol. Mass.:
361.3972
SMILES:
COc1cccc(CN=Nc2ncnc3c4cc(C)ccc4[nH]c23)c1OC
: