Target
Insulin-degrading enzyme
Ligand
BDBM75844
Substrate
Meas. Tech.
Dose Response: Fluorescence polarization-based cell-based high throughput dose response assay for inhibitors of insulin-degrading enzyme (IDE)
IC50
11553±n/a nM
Citation
 PubChem, PC Dose Response: Fluorescence polarization-based cell-based high throughput dose response assay for inhibitors of insulin-degrading enzyme (IDE) PubChem Bioassay (2010)[AID] 
Target
Name:
Insulin-degrading enzyme
Synonyms:
Abeta-degrading protease IDE Insulin degrading enzyme (hIDE) Insulin-degrading enzyme Insulysin | insulin-degrading enzyme isoform 1 precursor
Type:
Enzyme Catalytic Domain
Mol. Mass.:
117968.59
Organism:
Homo sapiens (Human)
Description:
P14735
Residue:
1019
  
Inhibitor
Name:
BDBM75844
Synonyms:
(Z)-3-[3,4-bis(oxidanyl)phenyl]-N-[(4-chlorophenyl)methyl]-2-cyano-prop-2-enamide (Z)-N-[(4-chlorophenyl)methyl]-2-cyano-3-(3,4-dihydroxyphenyl)-2-propenamide MLS001166668 cid_2389630
Type:
Small organic molecule
Emp. Form.:
C17H13ClN2O3
Mol. Mass.:
328.75
SMILES:
Oc1ccc(\C=C(\C#N)C(=O)NCc2ccc(Cl)cc2)cc1O
: