Target
Insulin-degrading enzyme
Ligand
BDBM58616
Substrate
Meas. Tech.
Dose Response: Fluorescence polarization-based cell-based high throughput dose response assay for inhibitors of insulin-degrading enzyme (IDE)
IC50
9709±n/a nM
Citation
 PubChem, PC Dose Response: Fluorescence polarization-based cell-based high throughput dose response assay for inhibitors of insulin-degrading enzyme (IDE) PubChem Bioassay (2010)[AID] 
Target
Name:
Insulin-degrading enzyme
Synonyms:
Abeta-degrading protease IDE Insulin degrading enzyme (hIDE) Insulin-degrading enzyme Insulysin | insulin-degrading enzyme isoform 1 precursor
Type:
Enzyme Catalytic Domain
Mol. Mass.:
117968.59
Organism:
Homo sapiens (Human)
Description:
P14735
Residue:
1019
  
Inhibitor
Name:
BDBM58616
Synonyms:
(E)-N-[[4-[(5-methyl-1,2-oxazol-3-yl)sulfamoyl]phenyl]carbamothioyl]-3-(4-methylphenyl)prop-2-enamide (E)-N-[[4-[(5-methylisoxazol-3-yl)sulfamoyl]phenyl]thiocarbamoyl]-3-(p-tolyl)acrylamide N-(5-Methyl-isoxazol-3-yl)-4-[3-(3-p-tolyl-acryloyl)-thioureido]-benzenesulfonamide cid_1985859
Type:
Small organic molecule
Emp. Form.:
C21H20N4O4S2
Mol. Mass.:
456.538
SMILES:
Cc1cc(NS(=O)(=O)c2ccc(NC(=S)NC(=O)C=Cc3ccc(C)cc3)cc2)no1
: