Target
Insulin-degrading enzyme
Ligand
BDBM75850
Substrate
Meas. Tech.
Dose Response: Fluorescence polarization-based cell-based high throughput dose response assay for inhibitors of insulin-degrading enzyme (IDE)
IC50
10584±n/a nM
Citation
 PubChem, PC Dose Response: Fluorescence polarization-based cell-based high throughput dose response assay for inhibitors of insulin-degrading enzyme (IDE) PubChem Bioassay (2010)[AID] 
Target
Name:
Insulin-degrading enzyme
Synonyms:
Abeta-degrading protease IDE Insulin degrading enzyme (hIDE) Insulin-degrading enzyme Insulysin | insulin-degrading enzyme isoform 1 precursor
Type:
Enzyme Catalytic Domain
Mol. Mass.:
117968.59
Organism:
Homo sapiens (Human)
Description:
P14735
Residue:
1019
  
Inhibitor
Name:
BDBM75850
Synonyms:
4-[(6-amino-1-butyl-2,4-diketo-pyrimidin-5-yl)-amyl-amino]-4-keto-butyric acid [2-keto-2-(4-propylphenyl)ethyl] ester MLS001128161 [2-oxidanylidene-2-(4-propylphenyl)ethyl] 4-[[6-azanyl-1-butyl-2,4-bis(oxidanylidene)pyrimidin-5-yl]-pentyl-amino]-4-oxidanylidene-butanoate cid_24981522
Type:
Small organic molecule
Emp. Form.:
C28H40N4O6
Mol. Mass.:
528.6404
SMILES:
CCCCCN(C(=O)CCC(=O)OCC(=O)c1ccc(CCC)cc1)c1c(N)n(CCCC)c(=O)[nH]c1=O
: