Target
Insulin-degrading enzyme
Ligand
BDBM75857
Substrate
Meas. Tech.
Dose Response: Fluorescence polarization-based cell-based high throughput dose response assay for inhibitors of insulin-degrading enzyme (IDE)
IC50
5780±n/a nM
Citation
 PubChem, PC Dose Response: Fluorescence polarization-based cell-based high throughput dose response assay for inhibitors of insulin-degrading enzyme (IDE) PubChem Bioassay (2010)[AID] 
Target
Name:
Insulin-degrading enzyme
Synonyms:
Abeta-degrading protease IDE Insulin degrading enzyme (hIDE) Insulin-degrading enzyme Insulysin | insulin-degrading enzyme isoform 1 precursor
Type:
Enzyme Catalytic Domain
Mol. Mass.:
117968.59
Organism:
Homo sapiens (Human)
Description:
P14735
Residue:
1019
  
Inhibitor
Name:
BDBM75857
Synonyms:
2-furancarboxylic acid [4-[(Z)-(3-acetamido-4-oxo-2-sulfanylidene-5-thiazolidinylidene)methyl]-2-methoxyphenyl] ester SMR001314898 [4-[(Z)-(3-acetamido-4-oxo-2-sulfanylidene-1,3-thiazolidin-5-ylidene)methyl]-2-methoxyphenyl] furan-2-carboxylate furan-2-carboxylic acid [4-[(Z)-(3-acetamido-4-keto-2-thioxo-thiazolidin-5-ylidene)methyl]-2-methoxy-phenyl] ester
Type:
Small organic molecule
Emp. Form.:
C18H14N2O6S2
Mol. Mass.:
418.444
SMILES:
COc1cc(\C=C2/SC(=S)N(NC(C)=O)C2=O)ccc1OC(=O)c1ccco1
: