Target
Apelin receptor
Ligand
BDBM269837
Substrate
Meas. Tech.
[35S]GTPgammaS Binding Assay
pH
7.5±n/a
EC50
10.00±n/a nM
Comments
extracted
Citation
 Chen, NChen, XChen, YFu, ZHeath, JAHorne, DBKaller, MRKhakoo, AYKopecky, DJMa, ZMihalic, JTSwaminath, GWang, XYeh, W Methods of treating heart failure US Patent  US10058550 Publication Date 8/28/2018 
Target
Name:
Apelin receptor
Synonyms:
AGTRL1 APJ_HUMAN Angiotensin receptor-like 1 Apelin receptor (APJ) G-protein coupled receptor HG11
Type:
Enzyme Catalytic Domain
Mol. Mass.:
42664.06
Organism:
Homo sapiens (Human)
Description:
P35414
Residue:
380
  
Inhibitor
Name:
BDBM269837
Synonyms:
(1R,2R)—N-(4-(2,6-dimethoxyphenyl)-5-(5-methylpyridin-3-yl)-4H-1,2,4-triazol-3-yl)-1-(5-fluoropyrimidin-2-yl)-1-methoxypropane-2-sulfonamide or (1S,2S)—N-(4-(2,6-dimethoxyphenyl)-5-(5-methylpyridin-3-yl)-4H-1,2,4-triazol-3-yl)-1-(5-fluoropyrimidin-2-yl)-1-methoxypropane-2-sulfonamide US10058550, Example 361.0 US9845310, Example 361.0
Type:
Small organic molecule
Emp. Form.:
C24H26FN7O5S
Mol. Mass.:
543.571
SMILES:
CO[C@H]([C@H](C)S(=O)(=O)Nc1nnc(-c2cncc(C)c2)n1-c1c(OC)cccc1OC)c1ncc(F)cn1
: