Target
Cannabinoid receptor 1
Ligand
BDBM76048
Substrate
Meas. Tech.
SAR analysis of agonists of the Cannabinoid Receptor 1 using an Image-Based Assay - Set 4
EC50
>32000±n/a nM
Citation
 PubChem, PC SAR analysis of agonists of the Cannabinoid Receptor 1 using an Image-Based Assay - Set 4 PubChem Bioassay (2010)[AID] 
Target
Name:
Cannabinoid receptor 1
Synonyms:
CANN6 CB-R CNR CNR1_HUMAN Cannabinoid receptor Cannabinoid receptor 1 (brain)
Type:
G Protein-Coupled Receptor (GPCR)
Mol. Mass.:
52868.96
Organism:
Homo sapiens (Human)
Description:
P21554
Residue:
472
  
Inhibitor
Name:
BDBM76048
Synonyms:
1-cyclopentyl-2-imino-5-keto-N-(2-morpholinoethyl)dipyrido[1,2-d:3',4'-f]pyrimidine-3-carboxamide 1-cyclopentyl-2-imino-N-[2-(4-morpholinyl)ethyl]-5-oxo-3-dipyrido[1,2-d:3',4'-f]pyrimidinecarboxamide MLS-0437145.0001 | cid_1050206
Type:
Small organic molecule
Emp. Form.:
C23H28N6O3
Mol. Mass.:
436.5068
SMILES:
N=c1c(cc2c(nc3ccccn3c2=O)n1C1CCCC1)C(=O)NCCN1CCOCC1
: