Target
G-protein coupled receptor 55
Ligand
BDBM76075
Substrate
Meas. Tech.
SAR Analysis of Selective Antagonists of GPR55 using an Image-Based Assay - Set 4
IC50
7700±n/a nM
Citation
 PubChem, PC SAR Analysis of Selective Antagonists of GPR55 using an Image-Based Assay - Set 4 PubChem Bioassay (2010)[AID] 
Target
Name:
G-protein coupled receptor 55
Synonyms:
G protein-coupled receptor 55 GPR55_HUMAN
Type:
PROTEIN
Mol. Mass.:
36649.72
Organism:
Homo sapiens (Human)
Description:
ChEMBL_1292265
Residue:
319
  
Inhibitor
Name:
BDBM76075
Synonyms:
2-(2,4-dimethylphenyl)-N-[4-(1,3-thiazol-2-ylsulfamoyl)phenyl]quinoline-4-carboxamide 2-(2,4-dimethylphenyl)-N-[4-(thiazol-2-ylsulfamoyl)phenyl]cinchoninamide cid_1358622
Type:
Small organic molecule
Emp. Form.:
C27H22N4O3S2
Mol. Mass.:
514.619
SMILES:
Cc1ccc(c(C)c1)-c1cc(C(=O)Nc2ccc(cc2)S(=O)(=O)Nc2nccs2)c2ccccc2n1
: