Target
Apelin receptor
Ligand
BDBM76115
Substrate
Meas. Tech.
Dose Response confirmation of uHTS hits from a small molecule agonists of the APJ receptor via a luminescent beta-arrestin assay
EC50
>100000±n/a nM
Citation
 PubChem, PC Dose Response confirmation of uHTS hits from a small molecule agonists of the APJ receptor via a luminescent beta-arrestin assay PubChem Bioassay (2010)[AID] 
Target
Name:
Apelin receptor
Synonyms:
AGTRL1 APJ_HUMAN Angiotensin receptor-like 1 Apelin receptor (APJ) G-protein coupled receptor HG11
Type:
Enzyme Catalytic Domain
Mol. Mass.:
42664.06
Organism:
Homo sapiens (Human)
Description:
P35414
Residue:
380
  
Inhibitor
Name:
BDBM76115
Synonyms:
6,7-diethoxy-3-[2-(4-methyl-1-piperidinyl)ethyl]-2-sulfanylidene-1H-quinazolin-4-one 6,7-diethoxy-3-[2-(4-methylpiperidino)ethyl]-2-thioxo-1H-quinazolin-4-one SMR000131242 | cid_3491393
Type:
Small organic molecule
Emp. Form.:
C20H29N3O3S
Mol. Mass.:
391.528
SMILES:
CCOc1cc2[nH]c(=S)n(CCN3CCC(C)CC3)c(=O)c2cc1OCC
: