Target
Lysine-specific histone demethylase 1A
Ligand
BDBM270457
Substrate
Meas. Tech.
LSD1 enzymatic assay
pH
7.5±n/a
Temperature
298.15±n/a K
IC50
42.0±n/a nM
Comments
extracted
Citation
 Vaisburg, AMarx, MA LSD1 inhibitors US Patent  US10059668 Publication Date 8/28/2018 
Target
Name:
Lysine-specific histone demethylase 1A
Synonyms:
AOF2 Flavin-containing amine oxidase domain-containing protein 2 KDM1A KIAA0601 Lysine-specific demethylase 1 (LSD1) Lysine-specific histone demethylase 1 (LSD1)
Type:
Enzyme
Mol. Mass.:
92901.01
Organism:
Homo sapiens (Human)
Description:
O60341
Residue:
852
  
Inhibitor
Name:
BDBM270457
Synonyms:
US10059668, Example 20
Type:
Small organic molecule
Emp. Form.:
C26H33N3O3S
Mol. Mass.:
467.624
SMILES:
CCS(=O)(=O)NC(=O)\C=C\c1ccc(CN2CCC(CC2)N[C@@H]2CC2c2ccccc2)cc1
: