Target
Delta-type opioid receptor
Ligand
BDBM75400
Substrate
Meas. Tech.
SAR Analysis of Agonists of the DOR Receptor using an Image-Based Assay - Set 3
EC50
>32000±n/a nM
Citation
 PubChem, PC SAR Analysis of Agonists of the DOR Receptor using an Image-Based Assay - Set 3 PubChem Bioassay (2010)[AID] 
Target
Name:
Delta-type opioid receptor
Synonyms:
D-OR-1 Delta opioid receptor OPIATE Delta OPRD1 OPRK1 | opioid receptor, delta 1
Type:
G Protein-Coupled Receptor (GPCR)
Mol. Mass.:
40382.98
Organism:
Homo sapiens (Human)
Description:
Competition binding assays were carried out using membrane preparations from transfected HN9.10 cells that constitutively expressed the delta opioid receptor.
Residue:
372
  
Inhibitor
Name:
BDBM75400
Synonyms:
2-[4-(2-thenyl)-5-[(2,4,6-trimethylbenzyl)thio]-1,2,4-triazol-3-yl]pyridine 2-[4-(thiophen-2-ylmethyl)-5-[(2,4,6-trimethylphenyl)methylthio]-1,2,4-triazol-3-yl]pyridine KUC104204N | cid_44620916
Type:
Small organic molecule
Emp. Form.:
C22H22N4S2
Mol. Mass.:
406.567
SMILES:
Cc1cc(C)c(CSc2nnc(-c3ccccn3)n2Cc2cccs2)c(C)c1
: