Target
Type-1 angiotensin II receptor
Ligand
BDBM76115
Substrate
Meas. Tech.
Dose Response screen for agonists of Angiotensin II Receptor Type 1 to assess selectivity of uHTS small molecule agonists hits of the APJ receptor
EC50
>100000±n/a nM
Citation
 PubChem, PC Dose Response screen for agonists of Angiotensin II Receptor Type 1 to assess selectivity of uHTS small molecule agonists hits of the APJ receptor PubChem Bioassay (2010)[AID] 
Target
Name:
Type-1 angiotensin II receptor
Synonyms:
AGTR1 AGTR1B AT1 AT1BR AT2R1B Angiotensin II receptor Type-1 angiotensin II receptor (AT1)
Type:
Protein
Mol. Mass.:
41080.75
Organism:
Homo sapiens (Human)
Description:
P30556
Residue:
359
  
Inhibitor
Name:
BDBM76115
Synonyms:
6,7-diethoxy-3-[2-(4-methyl-1-piperidinyl)ethyl]-2-sulfanylidene-1H-quinazolin-4-one 6,7-diethoxy-3-[2-(4-methylpiperidino)ethyl]-2-thioxo-1H-quinazolin-4-one SMR000131242 | cid_3491393
Type:
Small organic molecule
Emp. Form.:
C20H29N3O3S
Mol. Mass.:
391.528
SMILES:
CCOc1cc2[nH]c(=S)n(CCN3CCC(C)CC3)c(=O)c2cc1OCC
: