Target
Alkaline phosphatase, germ cell type
Ligand
BDBM76156
Substrate
Meas. Tech.
Dose Response confirmation of uHTS activators of Mouse Intestinal Alkaline Phosphatase using Placental Alkaline Phosphatase
EC50
89000±n/a nM
Citation
 PubChem, PC Dose Response confirmation of uHTS activators of Mouse Intestinal Alkaline Phosphatase using Placental Alkaline Phosphatase PubChem Bioassay (2010)[AID] 
Target
Name:
Alkaline phosphatase, germ cell type
Synonyms:
ALPG ALPPL2 PPBN_HUMAN | placental-like alkaline phosphatase preproprotein
Type:
PROTEIN
Mol. Mass.:
57374.31
Organism:
Homo sapiens (Human)
Description:
ChEMBL_29964
Residue:
532
  
Inhibitor
Name:
BDBM76156
Synonyms:
MLS001030334 N-(2,4-dimethylphenyl)-2-oxidanylidene-3H-1,3-benzoxazole-6-sulfonamide SMR000635467 | cid_7573833
Type:
Small organic molecule
Emp. Form.:
C15H14N2O4S
Mol. Mass.:
318.348
SMILES:
Cc1ccc(NS(=O)(=O)c2ccc3[nH]c(=O)oc3c2)c(C)c1
: