Target
Alkaline phosphatase, tissue-nonspecific isozyme
Ligand
BDBM76156
Substrate
Meas. Tech.
Dose Response confirmation of uHTS activators of Mouse Intestinal Alkaline Phosphatase using Tissue Nonspecific Alkaline Phosphatase.
EC50
58700±n/a nM
Citation
 PubChem, PC Dose Response confirmation of uHTS activators of Mouse Intestinal Alkaline Phosphatase using Tissue Nonspecific Alkaline Phosphatase. PubChem Bioassay (2010)[AID] 
Target
Name:
Alkaline phosphatase, tissue-nonspecific isozyme
Synonyms:
ALPL tissue-nonspecific alkaline phosphatase precursor
Type:
PROTEIN
Mol. Mass.:
57306.17
Organism:
Homo sapiens (Human)
Description:
ChEMBL_1448917
Residue:
524
  
Inhibitor
Name:
BDBM76156
Synonyms:
MLS001030334 N-(2,4-dimethylphenyl)-2-oxidanylidene-3H-1,3-benzoxazole-6-sulfonamide SMR000635467 | cid_7573833
Type:
Small organic molecule
Emp. Form.:
C15H14N2O4S
Mol. Mass.:
318.348
SMILES:
Cc1ccc(NS(=O)(=O)c2ccc3[nH]c(=O)oc3c2)c(C)c1
: