Target
Caspase-3
Ligand
BDBM38251
Substrate
Meas. Tech.
Dose Response confirmation of inhibitors of Sentrin-specific proteases (SENPs) using a Caspase-3 Selectivity assay
IC50
3720±n/a nM
Citation
 PubChem, PC Dose Response confirmation of inhibitors of Sentrin-specific proteases (SENPs) using a Caspase-3 Selectivity assay PubChem Bioassay (2010)[AID] 
Target
Name:
Caspase-3
Synonyms:
Apopain CASP3 CPP-32 Caspase 3 Caspase-3 subunit p17 SCA-1 Yama protein | caspase-3 preproprotein
Type:
Hydrolase; heterotetramer of two heterodimers
Mol. Mass.:
31607.55
Organism:
Homo sapiens (Human)
Description:
Residue:
277
  
Inhibitor
Name:
BDBM38251
Synonyms:
(4Z)-2-(1,3-benzothiazol-2-yl)-4-[1-(2-furanylmethylamino)ethylidene]-5-methyl-3-pyrazolone (4Z)-2-(1,3-benzothiazol-2-yl)-4-[1-(furan-2-ylmethylamino)ethylidene]-5-methyl-pyrazol-3-one 2-Benzothiazol-2-yl-4-{1-[(E)-furan-2-ylmethylimino]-ethyl}-5-methyl-1,2-dihydro-pyrazol-3-one SMR000011192 | cid_5453475
Type:
Small organic molecule
Emp. Form.:
C18H16N4O2S
Mol. Mass.:
352.41
SMILES:
CC(=NCc1ccco1)c1c(C)[nH]n(-c2nc3ccccc3s2)c1=O
: