Target
Caspase-3
Ligand
BDBM64897
Substrate
Meas. Tech.
Dose Response confirmation of inhibitors of Sentrin-specific proteases (SENPs) using a Caspase-3 Selectivity assay
IC50
4380±n/a nM
Citation
 PubChem, PC Dose Response confirmation of inhibitors of Sentrin-specific proteases (SENPs) using a Caspase-3 Selectivity assay PubChem Bioassay (2010)[AID] 
Target
Name:
Caspase-3
Synonyms:
Apopain CASP3 CPP-32 Caspase 3 Caspase-3 subunit p17 SCA-1 Yama protein | caspase-3 preproprotein
Type:
Hydrolase; heterotetramer of two heterodimers
Mol. Mass.:
31607.55
Organism:
Homo sapiens (Human)
Description:
Residue:
277
  
Inhibitor
Name:
BDBM64897
Synonyms:
MLS000027432 N-(4-oxidanylidene-1,3-benzothiazin-2-yl)benzamide SMR000034273 | cid_658982
Type:
Small organic molecule
Emp. Form.:
C15H10N2O2S
Mol. Mass.:
282.317
SMILES:
O=C(Nc1nc(=O)c2ccccc2s1)c1ccccc1
: