Target
Caspase-3
Ligand
BDBM76367
Substrate
Meas. Tech.
Dose Response confirmation of inhibitors of Sentrin-specific proteases (SENPs) using a Caspase-3 Selectivity assay
IC50
3130±n/a nM
Citation
 PubChem, PC Dose Response confirmation of inhibitors of Sentrin-specific proteases (SENPs) using a Caspase-3 Selectivity assay PubChem Bioassay (2010)[AID] 
Target
Name:
Caspase-3
Synonyms:
Apopain CASP3 CPP-32 Caspase 3 Caspase-3 subunit p17 SCA-1 Yama protein | caspase-3 preproprotein
Type:
Hydrolase; heterotetramer of two heterodimers
Mol. Mass.:
31607.55
Organism:
Homo sapiens (Human)
Description:
Residue:
277
  
Inhibitor
Name:
BDBM76367
Synonyms:
MLS000065767 N-(5-cyclohexyl-1,3,4-thiadiazol-2-yl)-2-methyl-3-furancarboxamide N-(5-cyclohexyl-1,3,4-thiadiazol-2-yl)-2-methylfuran-3-carboxamide cid_1245882
Type:
Small organic molecule
Emp. Form.:
C14H17N3O2S
Mol. Mass.:
291.369
SMILES:
Cc1occc1C(=O)Nc1nnc(s1)C1CCCCC1
: