Target
Caspase-3
Ligand
BDBM39565
Substrate
Meas. Tech.
Dose Response confirmation of inhibitors of Sentrin-specific proteases (SENPs) using a Caspase-3 Selectivity assay
IC50
3190±n/a nM
Citation
 PubChem, PC Dose Response confirmation of inhibitors of Sentrin-specific proteases (SENPs) using a Caspase-3 Selectivity assay PubChem Bioassay (2010)[AID] 
Target
Name:
Caspase-3
Synonyms:
Apopain CASP3 CPP-32 Caspase 3 Caspase-3 subunit p17 SCA-1 Yama protein | caspase-3 preproprotein
Type:
Hydrolase; heterotetramer of two heterodimers
Mol. Mass.:
31607.55
Organism:
Homo sapiens (Human)
Description:
Residue:
277
  
Inhibitor
Name:
BDBM39565
Synonyms:
2-(2-chlorophenyl)-5-(4-chlorophenyl)-1,3,4-oxadiazole SMR000103371 | cid_756156
Type:
Small organic molecule
Emp. Form.:
C14H8Cl2N2O
Mol. Mass.:
291.132
SMILES:
Clc1ccc(cc1)-c1nnc(o1)-c1ccccc1Cl
: