Target
Caspase-3
Ligand
BDBM76387
Substrate
Meas. Tech.
Dose Response confirmation of inhibitors of Sentrin-specific proteases (SENPs) using a Caspase-3 Selectivity assay
IC50
1730±n/a nM
Citation
 PubChem, PC Dose Response confirmation of inhibitors of Sentrin-specific proteases (SENPs) using a Caspase-3 Selectivity assay PubChem Bioassay (2010)[AID] 
Target
Name:
Caspase-3
Synonyms:
Apopain CASP3 CPP-32 Caspase 3 Caspase-3 subunit p17 SCA-1 Yama protein | caspase-3 preproprotein
Type:
Hydrolase; heterotetramer of two heterodimers
Mol. Mass.:
31607.55
Organism:
Homo sapiens (Human)
Description:
Residue:
277
  
Inhibitor
Name:
BDBM76387
Synonyms:
3-(2-methylphenyl)-7,8-dihydro-6H-cyclopenta[2,3]thieno[2,4-b][1,3]oxazin-1-one 6-o-Tolyl-2,3-dihydro-1H-5-oxa-8-thia-7-aza-cyclopenta[a]inden-4-one SMR000117715 | cid_828436
Type:
Small organic molecule
Emp. Form.:
C16H13NO2S
Mol. Mass.:
283.345
SMILES:
Cc1ccccc1-c1nc2sc3CCCc3c2c(=O)o1
: