Target
Caspase-3
Ligand
BDBM48245
Substrate
Meas. Tech.
Dose Response confirmation of inhibitors of Sentrin-specific proteases (SENPs) using a Caspase-3 Selectivity assay
IC50
1530±n/a nM
Citation
 PubChem, PC Dose Response confirmation of inhibitors of Sentrin-specific proteases (SENPs) using a Caspase-3 Selectivity assay PubChem Bioassay (2010)[AID] 
Target
Name:
Caspase-3
Synonyms:
Apopain CASP3 CPP-32 Caspase 3 Caspase-3 subunit p17 SCA-1 Yama protein | caspase-3 preproprotein
Type:
Hydrolase; heterotetramer of two heterodimers
Mol. Mass.:
31607.55
Organism:
Homo sapiens (Human)
Description:
Residue:
277
  
Inhibitor
Name:
BDBM48245
Synonyms:
(E)-3-(2-methoxy-4-nitro-anilino)-1-(2-thienyl)prop-2-en-1-one (E)-3-(2-methoxy-4-nitroanilino)-1-thiophen-2-ylprop-2-en-1-one 3-[(2-methoxy-4-nitrophenyl)amino]-1-(2-thienyl)-2-propen-1-one SMR000144035 | cid_5739690
Type:
Small organic molecule
Emp. Form.:
C14H12N2O4S
Mol. Mass.:
304.321
SMILES:
COc1cc(ccc1N=CCC(=O)c1cccs1)[N+]([O-])=O
: