Target
Caspase-3
Ligand
BDBM44019
Substrate
Meas. Tech.
Dose Response confirmation of inhibitors of Sentrin-specific proteases (SENPs) using a Caspase-3 Selectivity assay
IC50
4060±n/a nM
Citation
 PubChem, PC Dose Response confirmation of inhibitors of Sentrin-specific proteases (SENPs) using a Caspase-3 Selectivity assay PubChem Bioassay (2010)[AID] 
Target
Name:
Caspase-3
Synonyms:
Apopain CASP3 CPP-32 Caspase 3 Caspase-3 subunit p17 SCA-1 Yama protein | caspase-3 preproprotein
Type:
Hydrolase; heterotetramer of two heterodimers
Mol. Mass.:
31607.55
Organism:
Homo sapiens (Human)
Description:
Residue:
277
  
Inhibitor
Name:
BDBM44019
Synonyms:
4-Bromo-benzoic acid (1-phenyl-ethylidene)-hydrazide 4-bromo-N-(1-phenylethylideneamino)benzamide SMR000174313 | cid_824418
Type:
Small organic molecule
Emp. Form.:
C15H13BrN2O
Mol. Mass.:
317.181
SMILES:
CC(=NNC(=O)c1ccc(Br)cc1)c1ccccc1
: