Target
Caspase-3
Ligand
BDBM70782
Substrate
Meas. Tech.
Dose Response confirmation of inhibitors of Sentrin-specific proteases (SENPs) using a Caspase-3 Selectivity assay
IC50
2100±n/a nM
Citation
 PubChem, PC Dose Response confirmation of inhibitors of Sentrin-specific proteases (SENPs) using a Caspase-3 Selectivity assay PubChem Bioassay (2010)[AID] 
Target
Name:
Caspase-3
Synonyms:
Apopain CASP3 CPP-32 Caspase 3 Caspase-3 subunit p17 SCA-1 Yama protein | caspase-3 preproprotein
Type:
Hydrolase; heterotetramer of two heterodimers
Mol. Mass.:
31607.55
Organism:
Homo sapiens (Human)
Description:
Residue:
277
  
Inhibitor
Name:
BDBM70782
Synonyms:
(NZ)-N-[4-keto-3-(p-toluidino)-1-naphthylidene]thiophene-2-sulfonamide N-[(1Z)-3-[(4-methylphenyl)amino]-4-oxonaphthalen-1(4H)-ylidene]thiophene-2-sulfonamide N-[3-(4-methylanilino)-4-oxonaphthalen-1-ylidene]thiophene-2-sulfonamide N-[4-keto-3-(p-toluidino)-1-naphthylidene]thiophene-2-sulfonamide cid_4192573
Type:
Small organic molecule
Emp. Form.:
C21H16N2O3S2
Mol. Mass.:
408.493
SMILES:
Cc1ccc(NC2=CC(=NS(=O)(=O)c3cccs3)c3ccccc3C2=O)cc1
: