Target
Caspase-3
Ligand
BDBM70895
Substrate
Meas. Tech.
Dose Response confirmation of inhibitors of Sentrin-specific proteases (SENPs) using a Caspase-3 Selectivity assay
IC50
3620±n/a nM
Citation
 PubChem, PC Dose Response confirmation of inhibitors of Sentrin-specific proteases (SENPs) using a Caspase-3 Selectivity assay PubChem Bioassay (2010)[AID] 
Target
Name:
Caspase-3
Synonyms:
Apopain CASP3 CPP-32 Caspase 3 Caspase-3 subunit p17 SCA-1 Yama protein | caspase-3 preproprotein
Type:
Hydrolase; heterotetramer of two heterodimers
Mol. Mass.:
31607.55
Organism:
Homo sapiens (Human)
Description:
Residue:
277
  
Inhibitor
Name:
BDBM70895
Synonyms:
2-(allylamino)-3-chloro-1,4-naphthoquinone 2-chloranyl-3-(prop-2-enylamino)naphthalene-1,4-dione MLS000680589 cid_1716436
Type:
Small organic molecule
Emp. Form.:
C13H10ClNO2
Mol. Mass.:
247.677
SMILES:
Oc1c(Cl)c(N=CC=C)c(O)c2ccccc12
: