Target
Caspase-3
Ligand
BDBM49717
Substrate
Meas. Tech.
Dose Response confirmation of inhibitors of Sentrin-specific proteases (SENPs) using a Caspase-3 Selectivity assay
IC50
4380±n/a nM
Citation
 PubChem, PC Dose Response confirmation of inhibitors of Sentrin-specific proteases (SENPs) using a Caspase-3 Selectivity assay PubChem Bioassay (2010)[AID] 
Target
Name:
Caspase-3
Synonyms:
Apopain CASP3 CPP-32 Caspase 3 Caspase-3 subunit p17 SCA-1 Yama protein | caspase-3 preproprotein
Type:
Hydrolase; heterotetramer of two heterodimers
Mol. Mass.:
31607.55
Organism:
Homo sapiens (Human)
Description:
Residue:
277
  
Inhibitor
Name:
BDBM49717
Synonyms:
2-[1-(4-methoxyanilino)ethylidene]indene-1,3-dione 2-[1-[(4-methoxyphenyl)amino]ethylidene]indene-1,3-dione MLS000666686 cid_879788
Type:
Small organic molecule
Emp. Form.:
C18H15NO3
Mol. Mass.:
293.3166
SMILES:
[#6]-[#8]-c1ccc(-[#7]\[#6](-[#6])=[#6]-2/[#6](=O)-c3ccccc3-[#6]-2=O)cc1
: