Target
Caspase-3
Ligand
BDBM62277
Substrate
Meas. Tech.
Dose Response confirmation of inhibitors of Sentrin-specific proteases (SENPs) using a Caspase-3 Selectivity assay
IC50
4250±n/a nM
Citation
 PubChem, PC Dose Response confirmation of inhibitors of Sentrin-specific proteases (SENPs) using a Caspase-3 Selectivity assay PubChem Bioassay (2010)[AID] 
Target
Name:
Caspase-3
Synonyms:
Apopain CASP3 CPP-32 Caspase 3 Caspase-3 subunit p17 SCA-1 Yama protein | caspase-3 preproprotein
Type:
Hydrolase; heterotetramer of two heterodimers
Mol. Mass.:
31607.55
Organism:
Homo sapiens (Human)
Description:
Residue:
277
  
Inhibitor
Name:
BDBM62277
Synonyms:
1-[[(E)-(5-ethoxy-6-keto-cyclohexa-2,4-dien-1-ylidene)methyl]amino]-3-(2-nitrophenyl)thiourea 1-[[(E)-(5-ethoxy-6-oxo-1-cyclohexa-2,4-dienylidene)methyl]amino]-3-(2-nitrophenyl)thiourea MLS-0270696.0001 | cid_6297486
Type:
Small organic molecule
Emp. Form.:
C16H16N4O4S
Mol. Mass.:
360.388
SMILES:
CCOc1ccc[c-](C=[NH+]NC(=S)Nc2ccccc2[N+]([O-])=O)c1=O
: