Target
Caspase-3
Ligand
BDBM76529
Substrate
Meas. Tech.
Dose Response confirmation of inhibitors of Sentrin-specific proteases (SENPs) using a Caspase-3 Selectivity assay
IC50
2520±n/a nM
Citation
 PubChem, PC Dose Response confirmation of inhibitors of Sentrin-specific proteases (SENPs) using a Caspase-3 Selectivity assay PubChem Bioassay (2010)[AID] 
Target
Name:
Caspase-3
Synonyms:
Apopain CASP3 CPP-32 Caspase 3 Caspase-3 subunit p17 SCA-1 Yama protein | caspase-3 preproprotein
Type:
Hydrolase; heterotetramer of two heterodimers
Mol. Mass.:
31607.55
Organism:
Homo sapiens (Human)
Description:
Residue:
277
  
Inhibitor
Name:
BDBM76529
Synonyms:
2-(3-methoxyphenyl)-6-nitro-1,3-benzoxazole SMR000296210 | cid_1251410
Type:
Small organic molecule
Emp. Form.:
C14H10N2O4
Mol. Mass.:
270.2402
SMILES:
COc1cccc(c1)-c1nc2ccc(cc2o1)[N+]([O-])=O
: