Target
Caspase-3
Ligand
BDBM71273
Substrate
Meas. Tech.
Dose Response confirmation of inhibitors of Sentrin-specific proteases (SENPs) using a Caspase-3 Selectivity assay
IC50
4420±n/a nM
Citation
 PubChem, PC Dose Response confirmation of inhibitors of Sentrin-specific proteases (SENPs) using a Caspase-3 Selectivity assay PubChem Bioassay (2010)[AID] 
Target
Name:
Caspase-3
Synonyms:
Apopain CASP3 CPP-32 Caspase 3 Caspase-3 subunit p17 SCA-1 Yama protein | caspase-3 preproprotein
Type:
Hydrolase; heterotetramer of two heterodimers
Mol. Mass.:
31607.55
Organism:
Homo sapiens (Human)
Description:
Residue:
277
  
Inhibitor
Name:
BDBM71273
Synonyms:
3-(2-chloroanilino)-2H-isoquinolin-1-one 3-[(2-chlorophenyl)amino]-2H-isoquinolin-1-one SMR000472418 | cid_16727385
Type:
Small organic molecule
Emp. Form.:
C15H11ClN2O
Mol. Mass.:
270.714
SMILES:
Clc1ccccc1Nc1cc2ccccc2c(=O)[nH]1
: