Target
Caspase-3
Ligand
BDBM50305859
Substrate
Meas. Tech.
Dose Response confirmation of inhibitors of Sentrin-specific proteases (SENPs) using a Caspase-3 Selectivity assay
IC50
2400±n/a nM
Citation
 PubChem, PC Dose Response confirmation of inhibitors of Sentrin-specific proteases (SENPs) using a Caspase-3 Selectivity assay PubChem Bioassay (2010)[AID] 
Target
Name:
Caspase-3
Synonyms:
Apopain CASP3 CPP-32 Caspase 3 Caspase-3 subunit p17 SCA-1 Yama protein | caspase-3 preproprotein
Type:
Hydrolase; heterotetramer of two heterodimers
Mol. Mass.:
31607.55
Organism:
Homo sapiens (Human)
Description:
Residue:
277
  
Inhibitor
Name:
BDBM50305859
Synonyms:
5-methyl-3,6-diphenylisoxazolo[4,5-c]pyridin-4(5H)-one cid_4250909
Type:
Small organic molecule
Emp. Form.:
C19H14N2O2
Mol. Mass.:
302.3267
SMILES:
Cn1c(cc2onc(-c3ccccc3)c2c1=O)-c1ccccc1
: