Target
Sentrin-specific protease 6
Ligand
BDBM42216
Substrate
Meas. Tech.
Dose Response confirmation of uHTS for inhibitors of Sentrin-specific protease 6 (SENP6) using a Luminescent assay
IC50
2990±n/a nM
Citation
 PubChem, PC Dose Response confirmation of uHTS for inhibitors of Sentrin-specific protease 6 (SENP6) using a Luminescent assay PubChem Bioassay (2010)[AID] 
Target
Name:
Sentrin-specific protease 6
Synonyms:
KIAA0797 SENP6_HUMAN SUMO-1-specific protease Sentrin-specific protease 6 (SENP6)
Type:
Enzyme Catalytic Domain
Mol. Mass.:
126147.68
Organism:
Homo sapiens (Human)
Description:
Q9GZR1
Residue:
1112
  
Inhibitor
Name:
BDBM42216
Synonyms:
3-(4-fluoroanilino)-2H-isoquinolin-1-one 3-[(4-fluorophenyl)amino]-2H-isoquinolin-1-one SMR000152650 | cid_2323972
Type:
Small organic molecule
Emp. Form.:
C15H11FN2O
Mol. Mass.:
254.259
SMILES:
Fc1ccc(Nc2cc3ccccc3c(=O)[nH]2)cc1
: