Target
Voltage-dependent T-type calcium channel subunit alpha-1H
Ligand
BDBM76805
Substrate
Meas. Tech.
Inhibitors of T-Type Calcium Channel
EC50
8090±0 nM
Citation
 PubChem, PC Inhibitors of T-Type Calcium Channel PubChem Bioassay (2010)[AID] 
Target
Name:
Voltage-dependent T-type calcium channel subunit alpha-1H
Synonyms:
CAC1H_HUMAN Low-voltage-activated calcium channel alpha1 3.2 subunit Voltage-gated calcium channel voltage-dependent T-type calcium channel subunit alpha-1H isoform a
Type:
Enzyme Catalytic Domain
Mol. Mass.:
259187.68
Organism:
Homo sapiens (Human)
Description:
Calcium channel (Type T,L) 0 0::O95180
Residue:
2353
  
Inhibitor
Name:
BDBM76805
Synonyms:
2,3-Dihydro-benzo[1,4]dioxine-2-carboxylic acid (4-chloro-2,5-dimethoxy-phenyl)-amide N-(4-chloranyl-2,5-dimethoxy-phenyl)-2,3-dihydro-1,4-benzodioxine-3-carboxamide N-(4-chloro-2,5-dimethoxyphenyl)-2,3-dihydro-1,4-benzodioxin-3-carboxamide SMR000009462 | cid_645791
Type:
Small organic molecule
Emp. Form.:
C17H16ClNO5
Mol. Mass.:
349.766
SMILES:
COc1cc(NC(=O)C2COc3ccccc3O2)c(OC)cc1Cl
: