Target
RecBCD enzyme subunit RecD
Ligand
BDBM47570
Substrate
Meas. Tech.
Counterscreen for AddAB inhibitors: absorbance-based bacterial cell-based high throughput dose response assay to identify inhibitors of RecBCD
IC50
>118570±n/a nM
Citation
 PubChem, PC Counterscreen for AddAB inhibitors: absorbance-based bacterial cell-based high throughput dose response assay to identify inhibitors of RecBCD PubChem Bioassay (2010)[AID] 
Target
Name:
RecBCD enzyme subunit RecD
Synonyms:
RECD_ECOLI hopE | recD
Type:
Enzyme Catalytic Domain
Mol. Mass.:
66906.68
Organism:
Escherichia coli str. K-12 substr. MG1655
Description:
gi_16130723
Residue:
608
  
Inhibitor
Name:
BDBM47570
Synonyms:
(1Z)-1-[[2-[4-(1H-imidazol-2-yl)phthalazin-1-yl]hydrazinyl]methylidene]naphthalen-2-one (1Z)-1-[[[4-(1H-imidazol-2-yl)-1-phthalazinyl]hydrazo]methylidene]-2-naphthalenone SMR000151639 | cid_11948738
Type:
Small organic molecule
Emp. Form.:
C22H16N6O
Mol. Mass.:
380.402
SMILES:
Oc1ccc2ccccc2c1CN=Nc1nnc(-c2ncc[nH]2)c2ccccc12
: