Target
Mineralocorticoid receptor [729-984]
Ligand
BDBM238158
Substrate
Meas. Tech.
scintillation proximity assay (SPA)
IC50
740±n/a nM
Citation
 O Mahony, GKossenjans, MEdman, KKajanus, JHogner, CACornwall, PTurner, A Benzoxazinone amides as mineralocorticoid receptor modulators US Patent  US10017502 Publication Date 7/10/2018 
Target
Name:
Mineralocorticoid receptor [729-984]
Synonyms:
MCR MLR Mineralocorticoid receptor(MR)( (T729-K985) | NR3C2
Type:
Enzyme
Mol. Mass.:
29747.25
Organism:
Homo sapiens (Human)
Description:
amino acids T729-K985
Residue:
256
  
Inhibitor
Name:
BDBM238158
Synonyms:
US10017502, Example 4 | US9394291, 4
Type:
Small organic molecule
Emp. Form.:
C20H18FN3O5
Mol. Mass.:
399.3724
SMILES:
CNC(=O)CC1COc2cc(F)ccc2N1C(=O)c1ccc2OCC(=O)Nc2c1
: