Target
Ubiquitin-conjugating enzyme E2 N
Ligand
BDBM78525
Substrate
Meas. Tech.
Dose Response confirmation of uHTS for the identification of UBC13 Polyubiquitin Inhibitors via a TR-FRET Assay
IC50
9906±426 nM
Citation
 PubChem, PC Dose Response confirmation of uHTS for the identification of UBC13 Polyubiquitin Inhibitors via a TR-FRET Assay PubChem Bioassay (2011)[AID] 
Target
Name:
Ubiquitin-conjugating enzyme E2 N
Synonyms:
BLU UBE2N_HUMAN | ubiquitin-conjugating enzyme E2 N
Type:
PROTEIN
Mol. Mass.:
17137.61
Organism:
Homo sapiens (Human)
Description:
EBI_101440
Residue:
152
  
Inhibitor
Name:
BDBM78525
Synonyms:
MLS000032400 N-(2-methoxyphenyl)-2-[[5-(2-methyl-3-furanyl)-4-(2-phenylethyl)-1,2,4-triazol-3-yl]thio]acetamide N-(2-methoxyphenyl)-2-[[5-(2-methylfuran-3-yl)-4-(2-phenylethyl)-1,2,4-triazol-3-yl]sulfanyl]acetamide SMR000005720 | cid_655644
Type:
Small organic molecule
Emp. Form.:
C24H24N4O3S
Mol. Mass.:
448.537
SMILES:
COc1ccccc1NC(=O)CSc1nnc(-c2ccoc2C)n1CCc1ccccc1
: