Target
X-box-binding protein 1
Ligand
BDBM34320
Substrate
Meas. Tech.
XBP1 DR counterscreen for CHOP
IC50
5370±n/a nM
Citation
 PubChem, PC XBP1 DR counterscreen for CHOP PubChem Bioassay (2011)[AID] 
Target
Name:
X-box-binding protein 1
Synonyms:
TREB5 XBP1_HUMAN | XBP2
Type:
Enzyme Catalytic Domain
Mol. Mass.:
28704.14
Organism:
Homo sapiens (Human)
Description:
gi_47678753
Residue:
261
  
Inhibitor
Name:
BDBM34320
Synonyms:
MLS000098038 cid_2998049
Type:
Small organic molecule
Emp. Form.:
C21H25N5O
Mol. Mass.:
363.4561
SMILES:
CCCCC(CC)Cn1c2nc(C)oc(=N)c2c2nc3ccccc3nc12
: