Target
DNA damage-inducible transcript 3 protein
Ligand
BDBM63629
Substrate
Meas. Tech.
CHOP dose-response primary assay
IC50
4670±n/a nM
Citation
 PubChem, PC CHOP dose-response primary assay PubChem Bioassay (2011)[AID] 
Target
Name:
DNA damage-inducible transcript 3 protein
Synonyms:
Chop DDIT3_MOUSE Gadd153
Type:
Enzyme Catalytic Domain
Mol. Mass.:
19175.17
Organism:
Mus musculus
Description:
gi_160707929
Residue:
168
  
Inhibitor
Name:
BDBM63629
Synonyms:
4,5-bis(bromanyl)-2-(4-methylphenyl)pyridazin-3-one 4,5-dibromo-2-(4-methylphenyl)-3-pyridazinone 4,5-dibromo-2-(p-tolyl)pyridazin-3-one SMR000335544 | cid_1487485
Type:
Small organic molecule
Emp. Form.:
C11H8Br2N2O
Mol. Mass.:
344.002
SMILES:
Cc1ccc(cc1)-n1ncc(Br)c(Br)c1=O
: