Target
Tropomyosin alpha-1 chain
Ligand
BDBM68926
Substrate
Meas. Tech.
Fluorescence-based biochemical high throughput dose response assay for activators of the calcium sensitivity of cardiac Regulated Thin Filaments (RTF)
EC50
1369±n/a nM
Citation
 PubChem, PC Fluorescence-based biochemical high throughput dose response assay for activators of the calcium sensitivity of cardiac Regulated Thin Filaments (RTF) PubChem Bioassay (2011)[AID] 
Target
Name:
Tropomyosin alpha-1 chain
Synonyms:
TPM1 cardiac alpha tropomyosin
Type:
Enzyme Catalytic Domain
Mol. Mass.:
32681.01
Organism:
Sus scrofa
Description:
P42639
Residue:
284
  
Inhibitor
Name:
BDBM68926
Synonyms:
(2Z)-6-hydroxy-7-[[4-(2-hydroxyethyl)-1-piperazinyl]methyl]-2-[(E)-3-(2-methoxyphenyl)prop-2-enylidene]-3-benzofuranone (2Z)-6-hydroxy-7-[[4-(2-hydroxyethyl)piperazino]methyl]-2-[(E)-3-(2-methoxyphenyl)prop-2-enylidene]coumaran-3-one 6-Hydroxy-7-[4-(2-hydroxy-ethyl)-piperazin-1-ylmethyl]-2-[(E)-3-(2-methoxy-phenyl)-prop-2-en-(Z)-ylidene]-benzofuran-3-one SMR000221311 | cid_1953490
Type:
Small organic molecule
Emp. Form.:
C25H28N2O5
Mol. Mass.:
436.5002
SMILES:
COc1ccccc1\C=C\C=C1/Oc2c(ccc(O)c2CN2CCN(CCO)CC2)C1=O
: