Target
Tropomyosin alpha-1 chain
Ligand
BDBM79710
Substrate
Meas. Tech.
Fluorescence-based biochemical high throughput dose response assay for activators of the calcium sensitivity of cardiac Regulated Thin Filaments (RTF)
EC50
565.38±n/a nM
Citation
 PubChem, PC Fluorescence-based biochemical high throughput dose response assay for activators of the calcium sensitivity of cardiac Regulated Thin Filaments (RTF) PubChem Bioassay (2011)[AID] 
Target
Name:
Tropomyosin alpha-1 chain
Synonyms:
TPM1 cardiac alpha tropomyosin
Type:
Enzyme Catalytic Domain
Mol. Mass.:
32681.01
Organism:
Sus scrofa
Description:
P42639
Residue:
284
  
Inhibitor
Name:
BDBM79710
Synonyms:
MLS000335382 N-carbamoyl-2-[2-(3,3-dimethyl-2-oxobutylidene)-5-[[5-(4-nitrophenyl)-2-furanyl]methylidene]-4-oxo-3-thiazolidinyl]acetamide N-carbamoyl-2-[4-keto-2-(2-keto-3,3-dimethyl-butylidene)-5-[[5-(4-nitrophenyl)-2-furyl]methylene]thiazolidin-3-yl]acetamide cid_3565302
Type:
Small organic molecule
Emp. Form.:
C23H22N4O7S
Mol. Mass.:
498.508
SMILES:
CC(C)(C)C(=O)\C=c1/s\c(=C/c2ccc(o2)-c2ccc(cc2)[N+]([O-])=O)c(=O)n1CC(=O)NC(N)=O
: