Target
Tropomyosin alpha-1 chain
Ligand
BDBM75712
Substrate
Meas. Tech.
Fluorescence-based biochemical high throughput dose response assay for activators of the calcium sensitivity of cardiac Regulated Thin Filaments (RTF)
EC50
4529±n/a nM
Citation
 PubChem, PC Fluorescence-based biochemical high throughput dose response assay for activators of the calcium sensitivity of cardiac Regulated Thin Filaments (RTF) PubChem Bioassay (2011)[AID] 
Target
Name:
Tropomyosin alpha-1 chain
Synonyms:
TPM1 cardiac alpha tropomyosin
Type:
Enzyme Catalytic Domain
Mol. Mass.:
32681.01
Organism:
Sus scrofa
Description:
P42639
Residue:
284
  
Inhibitor
Name:
BDBM75712
Synonyms:
(4Z)-4-[(2Z)-2-(3-ethyl-1,3-benzoxazol-2-ylidene)ethylidene]-2-(ethylthio)-2-thiazolin-5-one (4Z)-4-[(2Z)-2-(3-ethyl-1,3-benzoxazol-2-ylidene)ethylidene]-2-ethylsulfanyl-1,3-thiazol-5-one SMR000280693 | cid_5756955
Type:
Small organic molecule
Emp. Form.:
C16H16N2O2S2
Mol. Mass.:
332.44
SMILES:
CCSC1=N\C(=C/C=C2\Oc3ccccc3N2CC)C(=O)S1
: