Target
Tropomyosin alpha-1 chain
Ligand
BDBM59497
Substrate
Meas. Tech.
Fluorescence-based biochemical high throughput dose response assay for activators of the calcium sensitivity of cardiac Regulated Thin Filaments (RTF)
EC50
2385±n/a nM
Citation
 PubChem, PC Fluorescence-based biochemical high throughput dose response assay for activators of the calcium sensitivity of cardiac Regulated Thin Filaments (RTF) PubChem Bioassay (2011)[AID] 
Target
Name:
Tropomyosin alpha-1 chain
Synonyms:
TPM1 cardiac alpha tropomyosin
Type:
Enzyme Catalytic Domain
Mol. Mass.:
32681.01
Organism:
Sus scrofa
Description:
P42639
Residue:
284
  
Inhibitor
Name:
BDBM59497
Synonyms:
5-[(2Z)-2-(2-ethyl-2-methyl-6-phenyl-1,3-dioxin-4-ylidene)ethylidene]-1,3-diazinane-2,4,6-trione MLS000712878 cid_5760788
Type:
Small organic molecule
Emp. Form.:
C19H18N2O5
Mol. Mass.:
354.3566
SMILES:
[#6]-[#6]C1([#6])[#8]\[#6](=[#6]/[#6]=[#6]-2/[#6](=O)-[#7]-[#6](=O)-[#7]-[#6]-2=O)-[#6]=[#6](-[#8]1)-c1ccccc1
: