Target
DNA dC->dU-editing enzyme APOBEC-3A
Ligand
BDBM55750
Substrate
Meas. Tech.
Dose Response confirmation of APOBEC3G DNA Deaminase Inhibitors via a A3A counterscreen
Temperature
298.15±n/a K
IC50
>100000±n/a nM
Comments
extracted
Citation
 PubChem, PC Dose Response confirmation of APOBEC3G DNA Deaminase Inhibitors via a A3A counterscreen PubChem Bioassay (2011)[AID] 
Target
Name:
DNA dC->dU-editing enzyme APOBEC-3A
Synonyms:
ABC3A_HUMAN probable DNA dC->dU-editing enzyme APOBEC-3A
Type:
Enzyme Catalytic Domain
Mol. Mass.:
23013.77
Organism:
Homo sapiens (Human)
Description:
gi_21955158
Residue:
199
  
Inhibitor
Name:
BDBM55750
Synonyms:
5-(2-phenylethylamino)-3H-1,3,4-thiadiazole-2-thione CHEMBL290545 SMR000289534 | cid_2916953
Type:
Small organic molecule
Emp. Form.:
C10H11N3S2
Mol. Mass.:
237.344
SMILES:
Sc1nnc(NCCc2ccccc2)s1
: