Target
DNA dC->dU-editing enzyme APOBEC-3G
Ligand
BDBM80394
Substrate
Meas. Tech.
Dose Response confirmation of APOBEC3A DNA Deaminase Inhibitors via a A3G counterscreen
Temperature
298.15±n/a K
IC50
3740±239 nM
Comments
extracted
Citation
 PubChem, PC Dose Response confirmation of APOBEC3A DNA Deaminase Inhibitors via a A3G counterscreen PubChem Bioassay (2011)[AID] 
Target
Name:
DNA dC->dU-editing enzyme APOBEC-3G
Synonyms:
ABC3G_HUMAN | APOBEC3G
Type:
Enzyme Catalytic Domain
Mol. Mass.:
46419.54
Organism:
Homo sapiens (Human)
Description:
gi_13399304
Residue:
384
  
Inhibitor
Name:
BDBM80394
Synonyms:
1,2-diethyl-3,6,6-trimethyl-5,7-dihydroindazol-1-ium-4-one;iodide SMR000129599 | cid_9550227
Type:
Small organic molecule
Emp. Form.:
C14H23N2O
Mol. Mass.:
235.3447
SMILES:
CCn1c(C)c2c(CC(C)(C)CC2=O)[n+]1CC
: