Target
DNA dC->dU-editing enzyme APOBEC-3A
Ligand
BDBM56683
Substrate
Meas. Tech.
Dose Response confirmation of small molecule APOBEC3A DNA Deaminase Inhibitors via a fluorescence-based single-stranded DNA deaminase assay
Temperature
298.15±n/a K
IC50
2140±n/a nM
Comments
extracted
Citation
 PubChem, PC Dose Response confirmation of small molecule APOBEC3A DNA Deaminase Inhibitors via a fluorescence-based single-stranded DNA deaminase assay PubChem Bioassay (2011)[AID] 
Target
Name:
DNA dC->dU-editing enzyme APOBEC-3A
Synonyms:
ABC3A_HUMAN probable DNA dC->dU-editing enzyme APOBEC-3A
Type:
Enzyme Catalytic Domain
Mol. Mass.:
23013.77
Organism:
Homo sapiens (Human)
Description:
gi_21955158
Residue:
199
  
Inhibitor
Name:
BDBM56683
Synonyms:
4-Acetoxy-9-bromo-3a-ethyl-5-hydroxy-8-methoxy-6-methyl-3a,4,5,5a,6,11,12,12b-oc SMR000306514 | cid_6618799
Type:
Small organic molecule
Emp. Form.:
C25H31BrN2O6
Mol. Mass.:
535.427
SMILES:
CC[C@]12C=CCN3CCC4(C(N(C)c5cc(OC)c(Br)cc45)[C@](O)([C@@H]1OC(C)=O)C(=O)OC)C23
: