Target
Glucose-6-phosphate 1-dehydrogenase
Ligand
BDBM34462
Substrate
Meas. Tech.
Human Glucose-6-Phosphate Dehydrogenase Dose Response Selectivity Assay for Inhibitors of Plasmodium falciparum Glucose-6-Phosphate Dehydrogenase
IC50
>80000±n/a nM
Citation
 PubChem, PC Human Glucose-6-Phosphate Dehydrogenase Dose Response Selectivity Assay for Inhibitors of Plasmodium falciparum Glucose-6-Phosphate Dehydrogenase PubChem Bioassay (2011)[AID] 
Target
Name:
Glucose-6-phosphate 1-dehydrogenase
Synonyms:
G6PD Glucose 6-phosphate dehydrogenase (G6PD) glucose-6-phosphate 1-dehydrogenase isoform b
Type:
Enzyme
Mol. Mass.:
59258.58
Organism:
Homo sapiens (Human)
Description:
P11413
Residue:
515
  
Inhibitor
Name:
BDBM34462
Synonyms:
(3,4-dichlorophenyl)-[4-(2-hydroxyethyl)-1-piperazinyl]methanethione (3,4-dichlorophenyl)-[4-(2-hydroxyethyl)piperazino]methanethione MLS000049575 cid_963027
Type:
Small organic molecule
Emp. Form.:
C13H16Cl2N2OS
Mol. Mass.:
319.25
SMILES:
OCCN1CCN(CC1)C(=S)c1ccc(Cl)c(Cl)c1
: