Target
Dihydrofolate reductase
Ligand
BDBM18490
Substrate
Meas. Tech.
Enzyme Inhibition Assay
Temperature
298.15±0 K
IC50
400±62 nM
Citation
 Liu, JBolstad, DBSmith, AEPriestley, NDWright, DLAnderson, AC Structure-guided development of efficacious antifungal agents targeting Candida glabrata dihydrofolate reductase. Chem Biol 15:990-6 (2008)  
Target
Name:
Dihydrofolate reductase
Synonyms:
DHFR Dihydrofolate reductase (DHFR) | Tetrahydrofolate dehydrogenase
Type:
Enzyme
Mol. Mass.:
21453.99
Organism:
Homo sapiens (Human)
Description:
Recombinant human DHFR.
Residue:
187
  
Inhibitor
Name:
BDBM18490
Synonyms:
6-methyl-5-[3-(3,4,5-trimethoxyphenyl)prop-1-yn-1-yl]pyrimidine-2,4-diamine Propargyl-linked, 5 TMP derivative with propargyl-based linker, 16
Type:
Small organic molecule
Emp. Form.:
C17H20N4O3
Mol. Mass.:
328.3657
SMILES:
COc1cc(CC#Cc2c(C)nc(N)nc2N)cc(OC)c1OC
: