Target
Mitogen-activated protein kinase kinase kinase 5
Ligand
BDBM81376
Substrate
Meas. Tech.
In Vitro Activity Assay
pH
7.5±0
IC50
>10000±0 nM
Citation
 Ranjitkar, PBrock, AMMaly, DJ Affinity reagents that target a specific inactive form of protein kinases. Chem Biol 17:195-206 (2010)  
Target
Name:
Mitogen-activated protein kinase kinase kinase 5
Synonyms:
ASK1 MAP3K5 MEKK5
Type:
Protein
Mol. Mass.:
154514.93
Organism:
Homo sapiens (Human)
Description:
Q99683
Residue:
1374
  
Inhibitor
Name:
BDBM81376
Synonyms:
Amine compound, 13a
Type:
Small organic molecule
Emp. Form.:
C42H47F3N8O7
Mol. Mass.:
832.8672
SMILES:
Cc1ccc(NC(=O)c2cccc(c2)C(F)(F)F)cc1Nc1ncccc1-c1cc(Nc2ccc(OCCNC(=O)COCCOCCOCCOCCN)cc2)ncn1
: