Target
p53 binding protein
Ligand
BDBM81631
Substrate
Meas. Tech.
HDM2 Binding Assay
IC50
>1.25e+5±n/a nM
Citation
 Cummings, MDSchubert, CParks, DJCalvo, RRLaFrance, LVLattanze, JMilkiewicz, KLLu, T Substituted 1,4-benzodiazepine-2,5-diones as alpha-helix mimetic antagonists of the HDM2-p53 protein-protein interaction. Chem Biol Drug Des 67:201-5 (2006)  
Target
Name:
p53 binding protein
Synonyms:
HDM2 HDM2-p53 protein | P53 binding protein
Type:
Protein
Mol. Mass.:
10726.49
Organism:
Homo sapiens (Human)
Description:
Q9H4C2
Residue:
98
  
Inhibitor
Name:
BDBM81631
Synonyms:
BZD Scaffold, 1
Type:
Small organic molecule
Emp. Form.:
C23H17N2O4
Mol. Mass.:
385.3926
SMILES:
[O-]C(=O)C(N1C(c2ccccc2)C(=O)Nc2ccccc2C1=O)c1ccccc1
: