Target
Gag-Pol polyprotein [588-1027]/[588-1147]
Ligand
BDBM1944
Substrate
(poly)rA:(oligo)dT(12-18)
Meas. Tech.
HIV-1 RT Assay
pH
8.2±n/a
Temperature
310.15±n/a K
IC50
422±92 nM
Citation
 Corbett, JWKo, SSRodgers, JDGearhart, LAMagnus, NABacheler, LTDiamond, SJeffrey, SKlabe, RMCordova, BCGarber, SLogue, KTrainor, GLAnderson, PSErickson-Viitanen, SK Inhibition of clinically relevant mutant variants of HIV-1 by quinazolinone non-nucleoside reverse transcriptase inhibitors. J Med Chem 43:2019-30 (2000)  
Target
Name:
Gag-Pol polyprotein [588-1027]/[588-1147]
Synonyms:
EC: 2.7.7.49 | HIV-1 Reverse Transcriptase
Type:
Protein Complex
Mol. Mass.:
115684
Description:
Components:
This complex has 2 components.
Component 1
Name:
Gag-Pol polyprotein [588-1147]
Synonyms:
HIV-1 Reverse Transcriptase Chain A gag-pol
Type:
Enzyme Subunit
Mol. Mass.:
64486.41
Organism:
Human immunodeficiency virus type 1
Description:
P04585[588-1147]
Residue:
560
  
Component 2
Name:
Gag-Pol polyprotein [588-1027]
Synonyms:
HIV-1 Reverse Transcriptase Chain B gag-pol
Type:
Enzyme Subunit
Mol. Mass.:
51337.13
Organism:
Human immunodeficiency virus type 1
Description:
P04585[588-1027]
Residue:
440
  
Inhibitor
Name:
BDBM1944
Synonyms:
BHAP deriv. DELAVIRDINE MESYLATE N-[2-({4-[3-(propan-2-ylamino)pyridin-2-yl]piperazin-1-yl}carbonyl)-1H-indol-5-yl]methanesulfonamide U-90152S
Type:
Small organic molecule
Emp. Form.:
C22H28N6O3S
Mol. Mass.:
456.561
SMILES:
CC(C)Nc1cccnc1N1CCN(CC1)C(=O)c1cc2cc(NS(C)(=O)=O)ccc2[nH]1
:
Substrate
Name:
(poly)rA:(oligo)dT(12-18)
Synonyms:
Type:
RNA-DNA duplex
Mol. Mass.:
358.43
Organism:
Description:
The incorporation of radiolabeled dTTP onto a (poly)rA:(oligo)dT(12-18) template:primer
Residue:
3
NA