Target
Adenosine receptor A1
Ligand
BDBM81787
Substrate
Ki
0.63±n/a nM
Comments
PDSP_2629
Citation
 Daly, JWPadgett, WL Agonist activity of 2- and 5'-substituted adenosine analogs and their N6-cycloalkyl derivatives at A1- and A2-adenosine receptors coupled to adenylate cyclase. Biochem Pharmacol 43:1089-93 (1992)  
Target
Name:
Adenosine receptor A1
Synonyms:
AA1R_RAT ADENOSINE A1 high Adenosine A1 receptor (A1) Adenosine receptors A1 | Adora1
Type:
Protein
Mol. Mass.:
36704.13
Organism:
Rattus norvegicus (rat)
Description:
Residue:
326
  
Inhibitor
Name:
BDBM81787
Synonyms:
N6-Cyclopentyl-5'chloro Adenosine | N6-Cyclopentyl-5'chloroAdo
Type:
Emp. Form.:
C14H18ClN5O3
Mol. Mass.:
339.777
SMILES:
O[C@@H]1[C@@H](Cl)O[C@H]([C@@H]1O)n1cnc2c(NC3CCCC3)ncnc12
: