Target
Alpha-2C adrenergic receptor
Ligand
BDBM81772
Substrate
Ki
48±n/a nM
Comments
PDSP_327
Citation
 Blaxall, HSMurphy, TJBaker, JCRay, CBylund, DB Characterization of the alpha-2C adrenergic receptor subtype in the opossum kidney and in the OK cell line. J Pharmacol Exp Ther 259:323-9 (1991) Target
Name:
Alpha-2C adrenergic receptor
Synonyms:
ADA2C_DIDVI Alpha-2C adrenergic receptor | adrenergic Alpha2C
Type:
Enzyme Catalytic Domain
Mol. Mass.:
53254.77
Organism:
OPOSSUM
Description:
adrenergic Alpha2C ADRA2C OPOSSUM::P35405
Residue:
469
  
Inhibitor
Name:
BDBM81772
Synonyms:
ARC-239 NSC_122211
Type:
Small organic molecule
Emp. Form.:
C25H30N2O3
Mol. Mass.:
406.5173
SMILES:
COc1ccccc1N1CCN(CCC2C(=O)c3ccccc3C(C)(C)C2=O)CC1
: