Target
Alpha-2C adrenergic receptor
Ligand
BDBM50019848
Substrate
Ki
2.4±n/a nM
Comments
PDSP_959
Citation
 Blaxall, HSMurphy, TJBaker, JCRay, CBylund, DB Characterization of the alpha-2C adrenergic receptor subtype in the opossum kidney and in the OK cell line. J Pharmacol Exp Ther 259:323-9 (1991) Target
Name:
Alpha-2C adrenergic receptor
Synonyms:
ADA2C_DIDVI Alpha-2C adrenergic receptor | adrenergic Alpha2C
Type:
Enzyme Catalytic Domain
Mol. Mass.:
53254.77
Organism:
OPOSSUM
Description:
adrenergic Alpha2C ADRA2C OPOSSUM::P35405
Residue:
469
  
Inhibitor
Name:
BDBM50019848
Synonyms:
2-(2,3-dihydro-1,4-benzodioxin-2-yl)-4,5-dihydro-1H-imidazole CHEMBL10316 US8633208, Idazoxan
Type:
Small organic molecule
Emp. Form.:
C11H12N2O2
Mol. Mass.:
204.2252
SMILES:
C1CN=C(N1)C1COc2ccccc2O1
: